Questions tagged [maven]

Maven is an open source build management tool that is part of the Apache project - https://maven.apache.org/.

Filter by
Sorted by
Tagged with
0
votes
0answers
33 views

Maven is not running any tests called using testng suitexml files in POM.xml

I am trying to run a test using Maven by providing the testng.xml file. It is not running any test, although the build is successful. POM.xml <project xmlns="http://maven.apache.org/POM/4.0.0&...
0
votes
4answers
417 views

TestNG- No tests found. Nothing was run

UTF-8 io.rest-assured rest-assured 4.1.2 test org.testng testng 6.14.3 ...
0
votes
1answer
88 views

Null Pointer Exception Error at Selenium TestNG

I'm trying to automate the search box but I'm getting null pointer exception. package LICT.Maven_ReCheck_Search; import java.util.concurrent.TimeUnit; import org.openqa.selenium.WebDriver; import ...
0
votes
0answers
70 views

How can i run my Cucumber project as a Maven Test as the Build passed but it shows Tests run: 0?

I have created a Cucumber project, which has multiple feature files, Step definition classes and one TestRunner.java class. Now, that project has a Maven project structure and i want to run it as a "...
1
vote
2answers
193 views

Jenkins doesn't execute tests

I have a Maven project and I'm using TestNG. My build completes in Jenkins, but the tests I want to run from my testng.xml file are not actually executed. I have my console output from Jenkins and ...
0
votes
1answer
435 views

Getting “testng.xml is not a valid file” error in Jenkins

I’m getting the following error when trying to run a Selenium/TestNg test from Jenkins. [ERROR] Suite file /development/apps/config/jenkins/jobs/teste-automatizado/workspace/Abc/testng.xml is not a ...
0
votes
0answers
22 views

read otp from seetest mobile application and paste to continue with login process in web application

I am using cucumber and configure appium and seetest to run web application on mobile browser, i want to check otp that is sent via my application to mobile number (on seetest device number which is i ...
3
votes
1answer
378 views

How to resolve NullPointerException error while implementing POM with cucumber framework

I am getting java.lang.NullPointerException while executing my test case, I am using Page Object Modle with cucumber framework in my maven project, following are the code snippets BoxJunitScript.java ...
1
vote
3answers
188 views

What is the use of Maven in Selenium WebDriver Automation Project?

Do we use Maven only to create dependencies in pom.xml file? Isn't there any other use of Maven in selenium project?
1
vote
2answers
586 views

Cannot initiate TestNG test

I'm learning to use selenium WebDriver with TestNG plugging for Eclipse and I ran into this issue where I can't execute the test case (it is unfinished but it has no compile errors nor warnings). ...
0
votes
1answer
144 views

Unable to Run Tests on Edge browser in Jenkins

I am trying to run my Tests in the Jenkins using Microsoft Edge. When I click on build now, I am getting the below error in the Console Output ------------------------------------------------------ ...
-1
votes
1answer
171 views

Not able to execute Selenium maven automation project using Eclipse Run as “Maven Test”

When i execute my selenium java project using maven test its not executing. its showing me error. Its execute properly when i execute through TestNG.xml file. But its showing error when execute it ...
3
votes
0answers
381 views

Using maven to create a standalone jar file that executes in any OS

I am trying to create a standalone selenium-TestNG tests Jar file that can be executed in any OS as part of CI/CD. My POM.xml is as follows: <project xmlns="http://maven.apache.org/POM/4.0.0&...
2
votes
1answer
2k views

Can I create an executable TestNG Selenium jar with my tests using maven

##### My POM file pom.xml http://maven.apache.org/xsd/maven-4.0.0.xsd"> 4.0.0 company.myproj myproj 0.0.1 jar <properties> <project.build.sourceEncoding>UTF-8</project....
1
vote
1answer
4k views

“org.openqa.selenium.WebDriverException: unknown error: Chrome failed to start: exited abnormally” issue on jenkins(openshift) chrome node

I've been trying to run selenium codes over Jenkins (server/openshift). There is chrome node in the jenkins machine for Test Automation - Selenium. I'm getting this error: org.openqa.selenium....
3
votes
2answers
2k views

Selenium UI Tests folder structure

I'm really new here and started writing some UI tests using selenium and testng and wanted to know how do you structure the folders, it is a maven project and using java. I'm putting all the test ...
0
votes
1answer
51 views

Maven dependencies are not getting updated after taking latest version of code

Maven dependencies are not getting updated automatically after taking the latest version from TFS. the Project has a red color mark and pom.xml file shows (x) mark. Please let me know how to resolve ...
1
vote
1answer
59 views

Automation Test Gradle Project using Selenium, can we keep test scripts outside src/test/java folder and access and if yes, how can we implement it?

In a maven/gradle project, can we keep source code of automation testing outside src/test/java or src/main/java folders, keeping that code creating a new folder inside project root? If yes, how can we ...
0
votes
1answer
535 views

Cucumber - Feature file with page object model approach

I am totally new to cucumber, I am using page object model approach. Let's say I have 3 page and 3 test classes Ex: login Page.java / loginTest.java Registration Page.java/Registration Test.java ...
1
vote
1answer
6k views

Maven Dependencies Selenium

I have started learning Selenium recently, but i am stuck on the first step itself, in-spite of adding all the required webdriver dependencies, while initiating the webdriver instance in a function, ...
1
vote
3answers
1k views

Set up proxy for selenide?

Is there any possibility to set up proxy for selenide library? I start autotests from command line with maven comman: mvn clean test [some params] site It was possible to change maven setting to ...
2
votes
2answers
6k views

testng.xml is not executing when we run pom.xml for maven project selenium

While executing my pom.xml file through maven test my BUILD is getting SUCCESSFUL but my testng.xml is not executing. I tried with executing 13 classes and with single class for both the time it ...
1
vote
2answers
4k views

Jmeter + Maven: how to add a jar file to JMeter /lib/ext folder

I have a Jmeter-Maven project and I'd like to put a modified jar file in "/lib/ext" folder. I've added it to “/src/test/jmeter/lib/ext”, but seems it doesn't work. Do I need to add dependencies to ...
1
vote
2answers
711 views

JMeter + Maven: how to send test result data to InfluxDB?

I use have JMeter tests run by jmeter-maven-plugin. I’d like to send my test results data to InfluxDB (in order to visualize results in Grafana). How can I do that? Do I need to set that in my POM ...
0
votes
1answer
2k views

Maven TestNG multiple suites in different folders

I'm working on a mobile automation task where I need to run test suites in parallel for 3 different iOS apps. Each test suite has its own testng.xml with a section configured to run on a device. I ...
1
vote
2answers
17k views

Maven installation Error JAVA_HOME not defined correctly but it really is defined correctly

Operating System Windows 10 java version "1.8.0_161" - jre C:\Users\admin>echo %JAVA_HOME% C:\Program Files\Java\jdk1.8.0_91\; Error (Command line) C:\Users\admin>mvn -version The JAVA_HOME ...
1
vote
1answer
111 views

Clean pom.xml from all not used dependencies

Maybe this question was already posted here. If yes, please attach the link, I couldn't find out the same. I would like to clean my old and not used dependencies from pom.xml, can someone advice me ...
0
votes
4answers
5k views

Cucumber test suite: how to pass username and password without hardcoding

I'm building a test suite with Cucumber on Java + Maven + jUnit and I need to pass a username and a password to the test suite so it can log in to the application under test. I don't like the idea of ...
2
votes
3answers
18k views

Cucumber step definitions in .feature file not highlight

In my project, I create simple feature file in my maven project using cucumber syntax. but IntelliJ IDEA, not highlight steps in feature file and also I cant use ALT+ENTER key to create step ...
1
vote
2answers
468 views

Can we run Robotframework test cases through Maven Surefire Plugin to run them parallel

Hi I have created some test cases in Robot framework and now I wat to run them in parallel. I know there is Pabot to run test suites in parallel but my requirement is to run them through Maven ...
3
votes
1answer
5k views

Unable to run cucumber tests from command line

I know this is the most common question but sorry I am posting this again as I tried all the solutions but couldn't solve the issue, Problem: I am unable to run my cucumber tests through maven and ...
1
vote
0answers
482 views

Cobertura analysis reporting “[ERROR] SLF4J: Class path contains multiple SLF4J bindings.”

Cobertura is reporting that there are multiple SLF4J bindings in the classpath, actually both related to different versions of the logback-classic artifact: [ERROR] SLF4J: Class path contains ...
5
votes
2answers
3k views

How to run tests in parallel using Robot Framework Maven plugin?

I'm using the Robot Framework Maven plugin to execute my Robot Framework scripts. I'm using this plugin because some of my keywords are implemented in Java and packaged inside an external library. I ...
2
votes
1answer
1k views

Jenkins: failing builds on warnings

I've been reading the book "Continuous Delivery: Reliable Software Releases through Build, Test, and Deployment Automation (Addison-Wesley Signature Series (Fowler))" And these paragraphs ...
1
vote
0answers
457 views

How to extend Selenium2Library by creating new RobotFramework keywords using Selenium WebDriver in Java?

I'm trying to extend the Selenium2Library python library (1.8.0) by implementing new Robot Framework keywords using Selenium WebDriver in Java. In order to do that, I need to be able to retrieve the ...
1
vote
2answers
11k views

Allure reports do not generate results when calling mvn test with arguments

If i run inside eclipse -> Run As -> Maven test, I have an allure-results directory created no problem in /target - Great! If I call mvn from the command line and pass in some arguments.... I have no ...
1
vote
1answer
179 views

Junit Setup & Teardown when using parallel cucumberJVM with auto generated test runner files

Scenario: I am using a cucumberJVM setup using a parallel cucumberJVM plugin which creates separate runner files for every feature file. I want to handle my setup & teardown independently, since ...
1
vote
2answers
3k views

Use enviornment variables in selenium properties file

I have a test package which is based on Selenium and the configuration is in a test.properties file. Now all the config values are hard coded there. I would like to hide some config values to hide ...
2
votes
2answers
74 views

Possibility of using maven surfire plugin for SOAP webservice tests

I have a challenge of using maven surfire plugin for SOAP webservices testing. What I need to check is whether this plugin can be used while running webservices tests in CI environment. I will ...
1
vote
0answers
84 views

Robot framework: how to point to libraries folder other than default?

I've set up a Maven project that uses Selenium (as a dependency) and would like to add Robot. The thing is, according to http://robotframework.org/MavenPlugin/: Third party libraries (e.g. Selenium ...
0
votes
2answers
1k views

java.sql.SQLException: No suitable driver found for jdbc:db2://URL/Database - pom.xml

In my Soapui project I am connecting Db2 for validation Groovy step. This seems to be working. When I run pop.xml with required dependency, its giving the following error: java.sql.SQLException: No ...
0
votes
1answer
2k views

Run unix commands using Jsch maven

Execute Unix commands using Jsch maven I'm trying use this code for performing the following steps, but it's not working. String command1 = "ls -ltr" String command2 = "cd /test/user/" String ...
0
votes
2answers
3k views

Execute SoapUI project with Maven and Jenkins

I am new to Maven and Jenkins. I have automated my web service project with SoapUI (the free version). I need to include my project with DEV builds for continuous integration build. I searched in ...
2
votes
1answer
2k views

Cucumber: Type Mismatch cannot covert from Class <Step Definition> to Class<?extends Runner> in eclipse

I have been playing around with Selenium Cucumber and came across this error message: Type mismatch: Cannot convert from Class StepDefinition to Class?extends Runner and here is my code: package ...
0
votes
2answers
1k views

Not able to install maven on windows [closed]

Getting error while trying to install maven on windows. What I have tried is, I have set the Environment variables as follows: System variable:: MAVEN_HOME :: C:\Users\hari\Downloads\apache-maven-3....
2
votes
2answers
163 views

CI for Selenium Project

I am not fully sure how to fully build Continuous Integration for Selenium project, so I would like to ask the following: Is it true that the only difference between a Maven project and a Java ...
0
votes
2answers
758 views

Windows task scheduler is invoking headless firefox driver instead of normal friefox driver

My below present simple batch file, on double clicking triggers the simple execution of my maven testng selenium webdriver script with NO issues cd C:\Users\xxxxxxx\Documents\SelTestsWorkspace\...
1
vote
0answers
1k views

Specifying and running multiple goals in Maven

I have created a testing framework using Cucumber, Selenium and Maven. I am using the cucumber-jvm-parallel plugin to run my tests in parallel. Below is how my pom.xml looks: <?xml version="1.0" ...
2
votes
1answer
1k views

Version Control for Selenium Itself

My question is about best practice. We are moving to Selenium and will be using Selenium, Maven, TestNG and GitHub, with a Windows environment. We will have about ten users, with more in the future. ...
1
vote
3answers
4k views

ExpectedConditions cannot be resolved to a variable

I am waiting for WebElement is clickable using below code: WebDriverWait wait = new WebDriverWait(driver,9); WebElement element = wait.until(ExpectedConditions.visibilityOf(CancelListingButton)); ...