Questions tagged [maven]

Maven is an open source build management tool that is part of the Apache project - https://maven.apache.org/.

14 questions with no upvoted or accepted answers
Filter by
Sorted by
Tagged with
3
votes
0answers
575 views

Using maven to create a standalone jar file that executes in any OS

I am trying to create a standalone selenium-TestNG tests Jar file that can be executed in any OS as part of CI/CD. My POM.xml is as follows: <project xmlns="http://maven.apache.org/POM/4.0.0&...
1
vote
1answer
7k views

“org.openqa.selenium.WebDriverException: unknown error: Chrome failed to start: exited abnormally” issue on jenkins(openshift) chrome node

I've been trying to run selenium codes over Jenkins (server/openshift). There is chrome node in the jenkins machine for Test Automation - Selenium. I'm getting this error: org.openqa.selenium....
1
vote
0answers
506 views

Cobertura analysis reporting "[ERROR] SLF4J: Class path contains multiple SLF4J bindings."

Cobertura is reporting that there are multiple SLF4J bindings in the classpath, actually both related to different versions of the logback-classic artifact: [ERROR] SLF4J: Class path contains ...
1
vote
0answers
470 views

How to extend Selenium2Library by creating new RobotFramework keywords using Selenium WebDriver in Java?

I'm trying to extend the Selenium2Library python library (1.8.0) by implementing new Robot Framework keywords using Selenium WebDriver in Java. In order to do that, I need to be able to retrieve the ...
1
vote
0answers
90 views

Robot framework: how to point to libraries folder other than default?

I've set up a Maven project that uses Selenium (as a dependency) and would like to add Robot. The thing is, according to http://robotframework.org/MavenPlugin/: Third party libraries (e.g. Selenium ...
1
vote
0answers
2k views

Specifying and running multiple goals in Maven

I have created a testing framework using Cucumber, Selenium and Maven. I am using the cucumber-jvm-parallel plugin to run my tests in parallel. Below is how my pom.xml looks: <?xml version="1.0" ...
0
votes
1answer
25 views

Unable to run test on gitlab pipeline due to DevToolsActivePort file doesn't exist

I created a sample Selenium Webdriver test using java and maven and pushed it out to my gitlab repository. Then I created a new pipeline to run the automated tests. This is my first time running a ...
0
votes
0answers
10 views

Action Bar for Debugging in Visual Studio Code runs for few seconds but then disappears

I have a Selenium with Java project in VSCode using Jenkins and Maven, however it's never been able to debug or step over or step into the code. Upon clicking the Debug Test from within the code the ...
0
votes
0answers
43 views

Build run test cases twice in Jenkins (Build now) with Maven Testng

Problem statement: Build run test case twice in Jenkins Build. working fine in the local environment Skills/Tools: Java, Maven, TestNG, Jenkins. I have tried removing testng.xml test classes. Don't ...
0
votes
0answers
25 views

having an error in pom.xml file from a cloned repository in eclipse from a bitbucket branch

this is my first time making a cloned repository in eclipse and using eclipse. i am having an error on my pom.xml file in this line: <project xmlns=*"http://maven.apache.org/POM/4.0.0"* ...
0
votes
0answers
773 views

How can i run my Cucumber project as a Maven Test as the Build passed but it shows Tests run: 0?

I have created a Cucumber project, which has multiple feature files, Step definition classes and one TestRunner.java class. Now, that project has a Maven project structure and i want to run it as a "...
0
votes
0answers
31 views

read otp from seetest mobile application and paste to continue with login process in web application

I am using cucumber and configure appium and seetest to run web application on mobile browser, i want to check otp that is sent via my application to mobile number (on seetest device number which is i ...
0
votes
1answer
3k views

Maven TestNG multiple suites in different folders

I'm working on a mobile automation task where I need to run test suites in parallel for 3 different iOS apps. Each test suite has its own testng.xml with a section configured to run on a device. I ...
-1
votes
1answer
377 views

Not able to execute Selenium maven automation project using Eclipse Run as "Maven Test"

When i execute my selenium java project using maven test its not executing. its showing me error. Its execute properly when i execute through TestNG.xml file. But its showing error when execute it ...