Stack Exchange Network

Stack Exchange network consists of 175 Q&A communities including Stack Overflow, the largest, most trusted online community for developers to learn, share their knowledge, and build their careers.

Visit Stack Exchange

Questions tagged [testng]

TestNG is a testing framework, inspired by the JUnit/NUnit unit testing frameworks. TestNG is intended to support more than just unit testing, allowing functional, end-to-end, integration, etc.

0
votes
1answer
33 views

Test cases stop execution for next test cases after using soft assertion

I have used soft assertion in my test cases, but it stops the execution of all the next test cases. what I know if we are adding soft assertion then particular test case should fail and it should jump ...
0
votes
2answers
41 views

I have added Assertion in my tc and make the login tc failed but I am not getting any output on console provided in assertion

I have added Assertion(Assert.asserttrue(true,"login failed")) in my every tc and conditions are according to that but when login tc failed I am not getting any output on console provided in ...
0
votes
0answers
19 views

Using maven to create a standalone jar file that executes in any OS

I am trying to create a standalone selenium-TestNG tests Jar file that can be executed in any OS as part of CI/CD. My POM.xml is as follows: <project xmlns="http://maven.apache.org/POM/4.0.0" ...
0
votes
2answers
39 views

How can we run only selected testcases from extent.html report in selenium webdriver?

I'am running testng suite and then extent.html report is being generated. Now I want to customize my report like; i should be able to select only failed testcases in my report and then should be able ...
0
votes
2answers
58 views

assertequals() returns true but make my test case failed

I have added assertion(Assert.assertEquals(condition,"expected","message")), it returns true then also it gives an error and make my testcase failed, with Assertion error and message? Can any one help ...
7
votes
4answers
15k views

TestNG vs Robot Framework - pros and cons

What are the pros and cons of using Robot Framework with selenium2Library (webdriver). Which one is the better option for web application testing - TestNG or Robot Framework?
1
vote
2answers
38 views

Chrome Driver - testNG parallel issue

I am trying to run selenium test classes parallel using testNG like this thread-count="3" parallel="classes" . But the issue is at closing the chrome driver and everything else works fine. while ...
1
vote
2answers
1k views

How to resolve NoSuchElementException in Selenium with java?

CODE: driver.findElement(By.name("USER")).sendKeys("XYZ"); driver.findElement(By.name("PASSWORD")).sendKeys("abc"); I have tried various ways not just name but by xpath, css selectors but every time ...
1
vote
1answer
38 views

Can I create an executable TestNG Selenium jar with my tests using maven

##### My POM file pom.xml http://maven.apache.org/xsd/maven-4.0.0.xsd"> 4.0.0 company.myproj myproj 0.0.1 jar <properties> <project.build.sourceEncoding>UTF-8</project....
0
votes
2answers
53 views

Getting nullpointer exception for 2nd test case working fine for login

Driver set to null for 2nd test case, working fine for login. Driver class: public class Driver { private static WebDriver driver;; /** * * @return * @throws Exception */ public static ...
0
votes
1answer
43 views

Unable to execute single tc, login then run other application features, right now its running as a suite

I have to execute my test cases as a single as well as a suite, right now its running as a suite but not as a single test case in selenium webdriver: Below is my test which are calling methods present ...
4
votes
2answers
11k views

How and where to store dynamic result/data using webdriver java

I want to know "How and where to store dynamic (Search results) result/data", I am getting the results and not sure what to do next. Also, after saving these results I want to use this in another ...
0
votes
2answers
345 views

Unable to read the parameter value inside a class using TestNG

To achieve parallel execution, I am updating my existing Junit project to TestNG. The requirement here is to run one scenario in different browsers using TestNG RunnerClass is as follows: import ...
-1
votes
2answers
32 views

Should you test regression tests or just verify/check?

When conducting regression tests, the goal is to find out if the new release affects existing functionalities of the application. Is it enough just to check/verify the application or should one test ...
0
votes
1answer
20 views

TestNG with multiple datadriven

My code structure logic is this: I have to fill three sequential forms to add a entry in a list whose data is from Excel. I need each form to have entries from different Excel sheet, i.e first form's ...
0
votes
0answers
20 views

Extent Report : [TestNG] Reporter x.x.ExtentReportListener.ExtentReport@afc191 failed java.lang.NullPointerException

Getting nullPointer exception in extent report . Help me on this issue unable to trace the root cause Using extent report 2.41.0 Here is the my log: [TestNG] Reporter com.psiexams.base....
0
votes
1answer
56 views

Selenium WebDriver “Cannot instantiate class ” error is coming

Below is my Base Class: package com.mercury.qa.base; import java.io.FileInputStream; import java.io.FileNotFoundException; import java.io.IOException; import java.util.Properties; import java.util....
1
vote
2answers
69 views

Web Service Testing Site

I practice web services testing but I don't have any web service testing site. Could anyone please suggest a good web service testing site? Please help. Thanks in advance.
0
votes
2answers
24 views

How to use assertion to compare both different size of the rows?

I want both size of the rows shouldn't be matched. int firstnum = 0; List<WebElement> preRoutlList = driver.findElements(By.xpath("//*[@id='txBottomTable']/table/tbody/tr")); ...
2
votes
1answer
44 views

Unable to pass dynamic xpath in repository file?

My code is : for (int z = 0; z < rows.size(); z++) { rows.get(z).findElement(By.xpath("//*[@class='ng-scope'][" + (z + 1) + "]//*[@placeholder='Stop Name']")).sendKeys(shuttleObj.getStopArea()); ...
0
votes
2answers
10k views

Selenium IE Webdriver showing “Only Local connection are allowed” in TestNG

I am trying to launch my application in IE browser in selenium using TestNG framework. But, after the IE browser is launched, the Eclipse console shows an error that "Only Local Connection are allowed"...
0
votes
1answer
48 views

Unable to find the correct xpath for input field?

Unable to locate the element. <div class="col-md-4"> <label class="radio-inline"> <input type="radio" name="routing_option" data-ng-model="generateRoutes" data-ng-value="'...
0
votes
1answer
42 views

Getting 'java.lang.NullPointerException' on executing test Cases

import org.openqa.selenium.WebDriver; import org.testng.Assert; import org.testng.annotations.AfterMethod; import org.testng.annotations.BeforeMethod; import org.testng.annotations....
0
votes
1answer
878 views

Import TestNG results from Jenkins to ALM

I have Jenkins on localhost, configured test project, which is generating passed test: @Test public void aFastTest() { System.out.println("---- ---- ----"); Assert.assertTrue(...
4
votes
1answer
2k views

Dependent methods in the same class run out of order only when included in a “testng suite”; running class independently respects the dependency

I have a class with dependent methods using the TestNG annotation dependsOnMethods The test runs fine 100% of the time if I simply run it as a TestNG Test from the package. When I include the test ...
0
votes
1answer
1k views

Maven TestNG multiple suites in different folders

I'm working on a mobile automation task where I need to run test suites in parallel for 3 different iOS apps. Each test suite has its own testng.xml with a section configured to run on a device. I ...
0
votes
2answers
65 views

Using TestNG framework : How to call other class of the methods

Using TestNG framework : How to call other class of the methods I have created one class for login and another class for add customer details. My scenario is: Once user login after add customer ...
-2
votes
1answer
57 views

How to assert that particular element is not displayed? [duplicate]

Can someone help me fixing NoSuchElementException. Let me explain what I am trying to do. I am trying to login into an application with multiple sets of data. Lets say, 1) Valid username and ...
0
votes
1answer
36 views

Getting error message on webpage but test cases get passed -using testng with selenium

Driver class: package com.deere.gmsr; import java.util.Properties; import java.util.concurrent.TimeUnit; import org.openqa.selenium.WebDriver; import org.openqa.selenium.chrome.ChromeDriver; ...
3
votes
3answers
2k views

Running failed test cases in TestNG

I have a suite which consists of 2 test cases. When I run this suite, the results should be 1 passed and 1 failed. When I am trying to run the failed test cases through TestNG-failed.xml file, it is ...
4
votes
1answer
1k views

TestNG: Multiple suite files are not running but single xml file is running multiple times

This is my testng.xml file: <suite name="Suite1" verbose="1" parallel="true" thread-count="5"> <suite-files> <suite-file path="xml-files/live.xml"></suite-file> ...
-1
votes
1answer
45 views

Getting “java.lang.NullPointerException” exception when i try to run my POM test [duplicate]

I have 2 classes in my project First class contains all the webelements Second one for method where i am using this elements package facebook; import org.openqa.selenium.By; import org.openqa....
0
votes
1answer
50 views

I need to verify a dynamic table record, if they match with data then PASS else Fail the test case using Assert

Page Object Class public class Transactions { WebDriver driver; boolean result1; public Transactions(WebDriver driver) { //super(); this.driver = driver; } public void ...
0
votes
2answers
147 views

I got the following error while automate the webpage using testNG

package browserhandling; import java.util.concurrent.TimeUnit; import org.openqa.selenium.By; import org.openqa.selenium.JavascriptExecutor; import org.openqa.selenium.WebDriver; import org.openqa....
0
votes
2answers
86 views

Not able to enter case-sensitive credential in android app

I am writing a test case for an android app where the app requires case-sensitive credentials. I writing test cases using appium and TestNG. Steps I am following are - Launching app Entering ...
0
votes
2answers
841 views

Can we access the value of a member or class variable of a test class in the testListner methods

I have a situation where 'xyz' is member variable of my testClass and I want to print some information in my report using that variable only. So I want to access 'xyz' in my 'onTestFailure' listner ...
1
vote
1answer
1k views

How to open messaging app during one android app test case is running to fetch otp

How do I open messaging app when test case is running for any other app. Need to fetch OTP from messaging app during a test case is running for my android app. I have tried to create new instance ...
0
votes
1answer
4k views

org.testng.TestNGException: Cannot find class in classpath: com.facebook.qa.testcases.LoginPageTest

[RemoteTestNG] detected TestNG version 6.14.2 org.testng.TestNGException: Cannot find class in classpath: com.facebook.qa.testcases.LoginPageTest at org.testng.xml.XmlClass.loadClass(XmlClass....
3
votes
2answers
712 views

When and how to do regression testing?

I am learning selenium. I am trying to get into more and more automation. Scenario (example): We are working in the agile. 2 weeks of sprint. We have a release after every 3 sprint. In our framework ...
1
vote
1answer
65 views

How can users run TestNG cases without using an IDE?

I run my test using Java, Selenium and TestNG. When I execute my test suite I have it set up where the testng.xml has all the configurations to run my tests. I am wondering, if I can set up some UI ...
0
votes
1answer
490 views

Can't able to run TestNG its show an error below I mentioned

[RemoteTestNG] detected TestNG version 6.14.2 org.testng.TestNGException: Cannot instantiate class testing.test at org.testng.internal.ObjectFactoryImpl.newInstance(ObjectFactoryImpl.java:30) ...
-1
votes
2answers
44 views

What is the best implementation strategy of Driver creation in Selenium Webdriver with Java?

As in my framework, I am creating the driver object by collecting the info from the test suite itself. We are passing the driver name through the testng suite and at runtime, we are collecting the ...
0
votes
1answer
53 views
0
votes
0answers
142 views

Cucumber and TestNG, how to pass parameter?

Could you please tell, how to pass parameter in Cucumber using TestNG? I have following code, but it does not work. Error in stepDefinition.java on the line @Parameters({"environment"}) testng.xml &...
-1
votes
2answers
48 views

How locate dynamic text field element inside dialog box?

I tried to using absolute xpath to locate the dynamic text field element after search but it fails. <div class="pzbtn-rgt" data-click="..."> <div class="pzbtn-mid" data-click="...."> <...
-1
votes
3answers
74 views

Getting Null pointer expections “ java.lang.NullPointerException ”

[RemoteTestNG] detected TestNG version 6.14.3 1553664942228 mozrunner::runner INFO Running command: "C:\Program Files\Mozilla Firefox\firefox.exe" "-marionette" "-foreground" "-no-remote" "-...
1
vote
0answers
59 views

How to launch 10 browser instances using Selenium Grid in the same machine

I'm trying to launch 10 browser instances (IE) in a virtual machine and execute same script 10 times parallelly on those browsers. I updated the IE node to have maxInstances=10" -maxSession 10 and ...
1
vote
2answers
65 views

TestNG @Test can have a testID?

I'm trying to adapt testrail api. I want to set a integer testID value for a @Test and get the value at iTestListener. In testNG, is there a way to specify a test id for each @Test? I tried ...
2
votes
4answers
3k views

Assert in TestNG (Actual int value, Expected int value)

Is there anyway to assert that, actual int value = expected int value not equal to 0 Something like, Assert.assertEquals(length, 0);
0
votes
2answers
3k views

How to find a button using both xpath and button text?

I have three buttons withing a div. All three buttons belong to same class (class names are same). What I want to do is capture each button using its text (Buttons have different texts) and xpath of ...