Questions tagged [testng]

TestNG is a testing framework, inspired by the JUnit/NUnit unit testing frameworks. TestNG is intended to support more than just unit testing, allowing functional, end-to-end, integration, etc.

53 questions with no upvoted or accepted answers
Filter by
Sorted by
Tagged with
3
votes
0answers
87 views

How to avoid using same data in parallel execution

This question is similar to How to manage application data when running multiple tests in parallel? But I want to know if there's a way or listener in testNG that will lock certain method when running ...
3
votes
0answers
599 views

Using maven to create a standalone jar file that executes in any OS

I am trying to create a standalone selenium-TestNG tests Jar file that can be executed in any OS as part of CI/CD. My POM.xml is as follows: <project xmlns="http://maven.apache.org/POM/4.0.0&...
3
votes
0answers
937 views

How can I make my solution thread safe for testNG parallel execution?

Background: For quite some time I have ran automated tests using forked JVM processes, this proved quite easy when injecting a driver object using spring, I could simply provide the following: @Bean(...
2
votes
0answers
192 views

BeforeClass doesn't get displayed in TestNG test results window

We are expanding our TestNG suite to run multiple tests. Doing so we've encountered a strange occurrence. In one suite I have two tests. Both tests have one class each. Tests in IntegrationTest.java ...
2
votes
0answers
734 views

How to keep test cases synced with HP ALM after refactoring?

We're planning to automate test synchronization between HP ALM QC and our TestNG test cases. We want to keep them synced in the following scenarios: Test adding: When creating TestNG test, a test ...
1
vote
0answers
37 views

Selenium- Parallel test case using testng not working correctly. The same working fine in sequential mode

The driver instance initializes as Threadsafe. Till the launching of the browser and pass the URL everything seems to be working. But the credentials passing on anyone's browser, instead of all ...
1
vote
1answer
1k views

How to select a dropdown value in Selenium WebDriver using Java appium?

I am new to Selenium, currently am working on selenium webdriver. I want to select a value from the drop-down. But I am not able to do it because of some error. Also, I want to inform you that in my ...
1
vote
1answer
180 views

In gradle 4.6, how to force all tests in a class gets executed first before moving to tests in next class?

I am using Gradle 4.6 with testng. My test suite has tests organized something like these. java class1 { test 1.1 test 1.2 test 1.3 test 1.4 } java class2 java class3 java class4 java class5 All ...
1
vote
0answers
218 views

How to launch 10 browser instances using Selenium Grid in the same machine

I'm trying to launch 10 browser instances (IE) in a virtual machine and execute same script 10 times parallelly on those browsers. I updated the IE node to have maxInstances=10" -maxSession 10 and ...
1
vote
0answers
785 views

How to control order of testNG package test execution without Priority or Dependency?

I have a package containing the tests I want to run. There are no priority or dependency setings at the testcase or suite level. <suite thread-count="1" name="reg 1"> <listeners> ...
1
vote
0answers
371 views

"NoSuchElementException" while executing Selenium script with TestNG

I'm trying to search a few records on a website. The input data is in an excel sheet and I need to write the search result into another excel sheet. And while executing the script, the screen hangs at ...
1
vote
0answers
113 views

How to extract adb dumpsys response for validation?

I need to validate few status of the android device. Can any one let me know how to extract the information from adb dumpsys and validate the responses using Java. Your help is much appreciated. Ex: '...
1
vote
0answers
160 views

Does it require to install all necessary software for slave in jenkins

I have built automation script and everything working perfectly. Now client want to run same script from his location. I am thinking to set his computer as slave in jenkins , but does it require to ...
1
vote
0answers
525 views

Unable to run as TestNG in Eclipse Kepler or Luna on Mac machine

I am using Mac Yosemite 10.10.3 and Eclipse Kepler (4.3). I installed latest TestNG from the official site testng.org and added it successfully from Help menu but TestNG option is not showing under ...
1
vote
0answers
97 views

Feed TestNG tests

Recently, I used feed4testng in order to run multiple instances of test using a data provider with feed4testng tool. But this tool only iterates through external resources. Is there any other tool for ...
0
votes
0answers
13 views

ScreenShot when failed not taken Selenium

I am trying to take a screenshot of the page when an exception is triggered. My main Class : @Listeners(CustomListener.class) public class AjoutPanier extends Base { @BeforeTest public void ...
0
votes
1answer
113 views

Facing error java.lang.RuntimeException: java.lang.NoSuchMethodException: jdk.proxy2.$Proxy9.proxyClassLookup() on run appium with POM

Hi everyone im facing this error on run appium with POM here is complete error java.lang.RuntimeException: java.lang.NoSuchMethodException: jdk.proxy2.$Proxy9.proxyClassLookup() at io.appium....
0
votes
0answers
32 views

I am not able to open Extent report that was generated at a specific timestamp when the Test ends?

I am trying to run a Cucumber Selenium project which is written in Java and use Test NG to run the Suite. Now, in the @AfterSuite Method, im trying to popup the Extent Html and pdf report both ...
0
votes
1answer
30 views

Why dont we use the main() method in TestNG class?

public class Tests{ @Test public void run(){ sop("this is test method 1"); } } How will Jvm know about entry point of the program? 🤔
0
votes
0answers
36 views

Jenkin fail without explanation running tests process exitcode 143

I have multiple test suites running on jenkins, however there is only one which never completes. It gets interrupted but never shows why The only thing I see in my console of the build is this: 04:13:...
0
votes
0answers
11 views

Running testNG suites dynamically_code just pick up same tesng.xml file every time

I'm using below code to dynamically load and run, testng.xml suites via, tCaseName variable(who's value is coming from excel file). I have 2 testng.xml files, who's name i have renamed to some ...
0
votes
0answers
68 views

When Tests Execute Randomly and in alphabetical order in TestNG?

When in TestNG, the @Test methods execute randomly and in what case they execute in alphabetical order? I have not using any priority tags or grouping tags either as parameters or as xml tags. https://...
0
votes
0answers
94 views

Build run test cases twice in Jenkins (Build now) with Maven Testng

Problem statement: Build run test case twice in Jenkins Build. working fine in the local environment Skills/Tools: Java, Maven, TestNG, Jenkins. I have tried removing testng.xml test classes. Don't ...
0
votes
0answers
244 views

Anyone had success running TestNg with Java 9 or above?

Has anybody successfully run the TestNG with >=Java 9? I tried and it failed. I also had no luck finding any helpful information from Google search. This is the error I got, Error occurred during ...
0
votes
0answers
415 views

TestNG Listener not working on XML

My testing XML is like below <?xml version="1.0" encoding="UTF-8"?> <!DOCTYPE suite SYSTEM "http://testng.org/testng-1.0.dtd"> <suite name="...
0
votes
0answers
61 views

How to execute test cases after ide crashed

Kindly suggest if I have 100 test cases after executing 40 Test Cases my IDE was crashed. So, on the next time when I am restarting my Test Cases again the execution should be start from 41 to 100. I ...
0
votes
0answers
1k views

Not able to run my test from testng.xml file

I'm not able to run by test case from testng.xml file after run of file I'm getting that Total tests run: 0, Failures: 0, Skips: 0 but if I will try to run the test class directly then test will run. ...
0
votes
0answers
825 views

While running TestNG program in eclipse getting error: A JNI error has occurred, please check your installation and try again

Getting JNI error while running TestNG program (that doesn't have main() function). But If trying to run the same program with same set of configuration (i.e. eclipse and java version), "Run as a ...
0
votes
0answers
1k views

How to resolve "Cannot find class in classpath: com.AES.Loginpage" error in Selenium?

I have created one java project and written a script for login to application using TestNG class. I got an error: "Cannot find class in classpath: com.AES.Loginpage" I have added jars and driver exe ...
0
votes
0answers
240 views

Looking for a java library automate third party Java-Swing application without access to the source code

I'm looking to automate a third party java swing application that my company uses. I don't have access to it's source code so a lot of the swing testing libraries like Assert-J won't work. I'd like to ...
0
votes
2answers
101 views

Element located when put in a single test case but not located when put in separate test case

I am in a weird situation where I found that my element is located when I wrote in a single test case. But as soon as I put that element in a separate test case, Unable to locate element Exception is ...
0
votes
2answers
1k views

TestNG with Eclipse: How to add main class?

How can I add main class in eclipse cucumber project. I am running cucumber feature file and using TestNG but getting error: "cannot find class in classpath" and as a resolution of this I am geeting ...
0
votes
2answers
108 views

Java Selenium: Custom Assert Message for Multiple Checkbox

I'm working with an automated script for multiple checkboxes that has dependent permissions. Given there are multiple checkboxes Checkbox A Checkbox B Checkbox C Checkbox D Checkbox E When I ...
0
votes
1answer
246 views

Unable to execute single tc, login then run other application features, right now its running as a suite

I have to execute my test cases as a single as well as a suite, right now its running as a suite but not as a single test case in selenium webdriver: Below is my test which are calling methods present ...
0
votes
2answers
131 views

How can we run only selected testcases from extent.html report in selenium webdriver?

I'am running testng suite and then extent.html report is being generated. Now I want to customize my report like; i should be able to select only failed testcases in my report and then should be able ...
0
votes
0answers
2k views

Cucumber and TestNG, how to pass parameter?

Could you please tell, how to pass parameter in Cucumber using TestNG? I have following code, but it does not work. Error in stepDefinition.java on the line @Parameters({"environment"}) ...
0
votes
2answers
196 views

Not able to enter case-sensitive credential in android app

I am writing a test case for an android app where the app requires case-sensitive credentials. I writing test cases using appium and TestNG. Steps I am following are - Launching app Entering ...
0
votes
1answer
3k views

Maven TestNG multiple suites in different folders

I'm working on a mobile automation task where I need to run test suites in parallel for 3 different iOS apps. Each test suite has its own testng.xml with a section configured to run on a device. I ...
0
votes
2answers
15k views

Selenium IE Webdriver showing "Only Local connection are allowed" in TestNG

I am trying to launch my application in IE browser in selenium using TestNG framework. But, after the IE browser is launched, the Eclipse console shows an error that "Only Local Connection are allowed"...
0
votes
2answers
3k views

Can we access the value of a member or class variable of a test class in the testListner methods

I have a situation where 'xyz' is member variable of my testClass and I want to print some information in my report using that variable only. So I want to access 'xyz' in my 'onTestFailure' listner ...
0
votes
1answer
1k views

Import TestNG results from Jenkins to ALM

I have Jenkins on localhost, configured test project, which is generating passed test: @Test public void aFastTest() { System.out.println("---- ---- ----"); Assert.assertTrue(...
0
votes
0answers
3k views

TestNG with Selenium Data and Keyword Driven Framework

I am new to TestNG. I'm using Hybrid Framework For Automation Testing, it's Hybrid Architecture based, in which Keyword(Java Methood name) and data is provided in Excel sheet, and based on that ...
0
votes
3answers
3k views

Test cases stop execution for next test cases after using soft assertion

I have used soft assertion in my test cases, but it stops the execution of all the next test cases. what I know if we are adding soft assertion then particular test case should fail and it should jump ...
-1
votes
2answers
607 views

Getting java.lang.NullPointerException while trying to instantiate the Webdriver driver under @ Annotation

Please find the code below and let me know why am I getting NullPointer. I am having no clue. package com.seleniumhybridframework.utility; import java.util.concurrent.TimeUnit; import org.openqa....
-1
votes
1answer
160 views

Extent reports issue in maven project

I am using extent reports in my project but it is showing me error and I am not getting solution for this error: [RemoteTestNG] detected TestNG version 6.14.3 Starting ChromeDriver 75.0.3770.140 (...
-1
votes
1answer
569 views

How to assert links count on web page through selenium webdriver

I have written below code in a separate class to count links on a particular webpage, How to assert this in a test case class: public static void navigateToLinkInHomePage() throws Exception { ...
-1
votes
2answers
333 views

Getting nullpointer exception for 2nd test case working fine for login

Driver set to null for 2nd test case, working fine for login. Driver class: public class Driver { private static WebDriver driver;; /** * * @return * @throws Exception */ public static ...
-1
votes
2answers
123 views

How locate dynamic text field element inside dialog box?

I tried to using absolute xpath to locate the dynamic text field element after search but it fails. <div class="pzbtn-rgt" data-click="..."> <div class="pzbtn-mid" data-click="...."> <...
-1
votes
3answers
661 views

Getting Null pointer expections " java.lang.NullPointerException "

[RemoteTestNG] detected TestNG version 6.14.3 1553664942228 mozrunner::runner INFO Running command: "C:\Program Files\Mozilla Firefox\firefox.exe" "-marionette" "-foreground" "-no-remote" "-...
-1
votes
1answer
452 views

How do I run multiple testcases defined in different classes with two different logins using Selenium,Java and TestNG?

Example: Public class A() { Method A1 Method A2 } Public class B() { Method B1 Method B2 } I am using dataprovider to get the login info (id and password) from excel Public class login() { User1 ...